{"text_format":"1","workbook":"xlsx","n_sheets":17,"sheets":["Attention","BlankBackground","ProgramSettings","Settings","Startseite","Hilfe","Text DNS","Text Chakren","Analyse","Graphik DNS","Graphik Chakren","data","Heilmittel-Liste","Heilmittel GLOBAL","arszWksRemediesTemplate","arszWksDescriptionsTemplate","Beschreibungen"],"not_rendered":{"charts":3,"images":1,"macros":1,"external_links":0,"defined_names":27,"comments":0,"pivot_tables":0},"unopened":[],"bounds":{"document_bytes":16777216,"sheet_cells":100000,"rows_first":2000,"rows_last":500,"rows_between":2000,"halvings":0,"cell_chars":16384,"cell_head_chars":4096},"cells_cut":0,"cells_raw":0,"read":"whole","date_system":"1900"}

{"sheet":"Attention","index":0,"n_rows":20,"n_cols":4,"rows_kept":20,"cut":false,"hidden":true,"merged":[]}
[null,"ATTENTION!",null,"ACHTUNG!"]
[null,"What do you have to do when opening\nthis Excel workbook for the first time?",null,"Wie müssen Sie beim ersten Öffnen \ndieser Excel-Arbeitsmappe vorgehen?"]
[null,{"$f":"IF(ProgramSettings!C4=\"\",\"\",\"Note: You are using Excel \"&ProgramSettings!C4&\".\")","v":"Note: You are using Excel 2016."},null,{"$f":"IF(ProgramSettings!C4=\"\",\"\",\"Hinweis: Sie verwenden Excel \"&ProgramSettings!C4&\".\")","v":"Hinweis: Sie verwenden Excel 2016."}]
[]
[]
[null,"Microsoft Excel 2003",null,"Microsoft Excel 2003"]
[null,"Option 1: Please click the Tools tab (to find in the top area of the Excel window), and then click \"Macro\" → \"Security...\"! Please ensure that you have selected the option \"Medium Security\" on the \"Security Level\" tab and also checked \"Trust access to Visual Basic Project\" on the \"Trusted Publishers\" tab! Please click the \"OK\" button then to apply your changings! After you have followed these instructions please restart Microsoft Excel (just close and reopen)!\nWhen you reopen this Excel workbook, you should see besides the regular Excel window another one with the title \"Security Warning\". Please click there on \"Enable Macros\"! After that you should have full access to all functions of this workbook.",null,"Variante 1: Stellen Sie sicher, dass Sie in Excel in der Menüleiste unter „Extras“ → „Makro“ → „Sicherheit...“ → Reiter “Sicherheitsstufe“ die Stufe \"Mittel\" ausgewählt und zusätzlich im Reiter \"Vertrauenswürdige Herausgeber\" (in demselben Fenster) einen Haken bei „Zugriff auf Visual Basic-Projekt vertrauen“ gesetzt haben. Um die Änderungen zu übernehmen, bestätigen Sie anschließend bitte mit Klick auf „OK“. Nachdem Sie diese Einstellungen vorgenommen haben, starten Sie Excel bitte neu (einfach schließen und danach wieder öffnen)!\nSobald Sie diese Arbeitsmappe nun erneut öffnen, sollte ein separates Fenster mit dem Titel \"Sicherheitswarnung\" zu sehen sein. Klicken Sie dort bitte auf \"Makros aktivieren\"! Sie sollten nun problemlos alle Funktionen dieser Arbeitsmappe nutzen können."]
[null,"Option 2: The disadvantage of the last option is that every time when you open the file, the window with the title \"Security Warning\" will appear, and that the macros have to be enabled manually once again every file opening (like descriped above). Alternatively, you can choose the setting \"Low Security\" (as substitute for \"Medium Security\") in the Excel options. Hereby, the macros will be activated automatically when opening the excel file (and the window with the security warning will not appear anymore). If you work a lot with Excel files from unknown sources, Option 2 is not recommended. That is because Excel files from unknown sources might contain potentially dangerous source code which is executed automatically with Option 2 when opening the Excel file.",null,"Variante 2: Der Nachteil der vorigen Variante besteht darin, dass nun jedes Mal beim Öffnen der Datei das Fenster mit dem Titel \"Sicherheitswarnung\" erscheint und der Inhalt jedes Mal erneut (wie oben beschrieben) von Hand aktiviert werden muss. Alternativ können Sie in den Excel-Optionen anstatt der Sicherheitsstufe \"Mittel\" auch die Stufe \"Niedrig\" auswählen. Hierdurch werden die Makros beim Öffnen der Datei bereits automatisch aktiviert (und das Fenster mit der Sicherheitswarnung erscheint nicht länger). Sofern Sie häufig mit Excel-Dateien aus fremden Quellen zu tun haben, ist die Variante 2 allerdings nicht zu empfehlen. Dies liegt darin begründet, dass Excel-Dateien von Dritten potentiell gefährlichen Quellcode, der durch Variante 2 beim Öffnen der Datei automatisch ausgeführt wird, enthalten könnten."]
[]
[null,"Microsoft Excel 2007",null,"Microsoft Excel 2007"]
{"$rows_left_out":11}
{"sheet":"BlankBackground","index":1,"n_rows":0,"n_cols":0,"rows_kept":0,"cut":false,"hidden":true,"merged":[]}

{"sheet":"ProgramSettings","index":2,"n_rows":518,"n_cols":6,"rows_kept":518,"cut":false,"hidden":true,"merged":[[199,2,199,8],[200,2,200,8],[201,2,201,8],[202,2,202,8]]}
["Art der Programmeinstellung/-information","Wert 1","Wert 2","Wert 3"]
["Zeiger zur Wiederherstellung des Objekt-verweises zum IRibbonUI-Objekt (RibbonX):",364989880,"[PLATZHALTER]","[PLATZHALTER]"]
["PC / Mac:",{"$f":"INFO(\"SYSTEM\")","v":"pcdos"},{"$f":"IF($B$3=\"pcdos\",\"Windows\",\"Mac\")","v":"Windows"},"[PLATZHALTER]"]
["Verwendete Excel-Version:",{"$f":"IF(ISERROR($B$5)=FALSE,$B$5,INFO(\"RELEASE\"))","v":"16.0"},{"$f":"IF(ISERROR($C$5)=FALSE,$C$5,\"\")","v":"2016"},"[PLATZHALTER]"]
["Hilfszeile zur Ermittlung der Excel-Version:",{"$f":"INFO(\"VERSION\")","v":"16.0"},{"$f":"VLOOKUP(LEFT($B$4,2),$B$101:$C$198,2,FALSE)","v":"2016"},"[PLATZHALTER]"]
[]
[]
[]
[]
["Versions-Nr. (inkl. Build) dieser Arbeitsmappe:","[PLATZHALTER]","[PLATZHALTER]","[PLATZHALTER]"]
{"$rows_left_out":509}
{"sheet":"Settings","index":3,"n_rows":0,"n_cols":0,"rows_kept":0,"cut":false,"hidden":true,"merged":[]}

{"sheet":"Startseite","index":4,"n_rows":0,"n_cols":0,"rows_kept":0,"cut":false,"hidden":true,"merged":[]}

{"sheet":"Hilfe","index":5,"n_rows":139,"n_cols":4,"rows_kept":139,"cut":false,"hidden":true,"merged":[[25,0,25,11],[24,3,24,12],[114,2,114,12],[116,2,116,12],[16,3,16,12],[23,0,23,12],[6,3,8,12],[10,3,10,12],[12,3,14,12],[15,0,15,12],[20,3,22,12],[118,2,118,12],[120,3,120,5],[122,3,122,4],[121,3,121,4],[124,3,124,4],[138,2,138,12],[136,2,136,12],[125,3,125,4],[126,3,126,4],[128,2,128,12],[130,2,130,12],[132,3,132,4]]}
[]
[null,"Hilfe zur Software \"DNS Aktivierung\""]
[]
[]
[null,"Personelle Voraussetzungen"]
[]
[null,null,"m","Das Programm greift in Bewusstseinsprozesse ein und deshalb sollten alle Anwendungen bewusst und ernsthaft durchgeführt werden."]
[]
[]
[]
{"$rows_left_out":130}
{"sheet":"Text DNS","index":6,"n_rows":30,"n_cols":3,"rows_kept":30,"cut":false,"hidden":true,"merged":[]}
[]
[null,"Die zwölf DNS-Stränge"]
[]
[null,"1. Lebenskraft"]
[null,null,"Dies ist der einzige DNS Strang der physisch ausgebildet ist und den die Wissenschaft kennt. Durch ihn erhalten wir die Fähigkeiten mit einem Körper das irdische Leben zu meistern. "]
[null,"2. Lebensziel"]
[null,null,"Dieser DNS-Strang beschreibt unseren Lebensplan und die Lernziele, die erreicht werden sollen. Diese Informationen sind sehr ähnlich mit dem Inhalt eines Geburtshoroskopes"]
[null,"3. Schöpferkraft"]
[null,null,"Mit dieser Fähigkeit wird unser Schöpfungspotenzial definiert. Dies bezieht sich nicht nur auf das Zeugen von Nachkommen sondern ganz allgemein auf das Erschaffen von Werken, die unsere Existenz überdauern."]
[]
{"$rows_left_out":21}
{"sheet":"Text Chakren","index":7,"n_rows":12,"n_cols":9,"rows_kept":12,"cut":false,"hidden":true,"merged":[]}
[]
[null,"Die Sieben Hauptchakren"]
[]
[]
[null,null,null,null,null,null,"Funktion",null,"Drüse"]
[null,null,null,null,"7. Scheitel-Chakra",null,"Spiritualität",null,"Epiphyse"]
[null,null,null,null,"6. Stirn-Chakra",null,"Intuition",null,"Hypophyse"]
[null,null,null,null,"5. Hals-Chakra",null,"Kommunikation",null,"Schilddrüse"]
[null,null,null,null,"4. Herz-Chakra",null,"Liebe",null,"Thymusdrüse"]
[null,null,null,null,"3. Nabel-Chakra",null,"Gefühle",null,"Bauchspeicheldrüse"]
{"$rows_left_out":3}
{"sheet":"Analyse","index":8,"n_rows":18,"n_cols":19,"rows_kept":18,"cut":false,"hidden":false,"merged":[]}
[]
[null,null,"DNS Selektionen"]
[]
[null,null,"Physische Ebene",null,null,null,"Emotionale Ebene",null,null,null,"Geistige Ebene",null,null,null,"Spirituelle Ebene"]
[null," Herr Max Mustermann\n Geburtsort: Musterstadt\n Geburtstag: 20.06.1978\n\n Beratung: Dr. Peter Ruppel\n am 14.05.2018 um 13:53 Uhr"," 1. Lebenskraft"," 2. Lebensziel"," 3. Schöpfungskraft",null," 4. Wohlbefinden"," 5. Lebensfreude"," 6. Wahrhaftigkeit",null," 7. Ordnung"," 8. Weisheit"," 9. Harmonie",null," 10. Sein"," 11. Bewusstsein"," 12. Glückseligkeit",null," Durchschnitt je Chakra"]
[null," 7. Scheitel-Chakra",29,14,78,null,82,56,22,null,21,33,20,null,47,40,11,null,{"$f":"IFERROR(ROUND(AVERAGE(C6:E6,G6:I6,K6:M6,O6:Q6),0),\"\")","v":38}]
[null," 6. Stirn-Chakra",18,42,30,null,3,63,98,null,79,1,73,null,1,55,93,null,{"$f":"IFERROR(ROUND(AVERAGE(C7:E7,G7:I7,K7:M7,O7:Q7),0),\"\")","v":46}]
[null," 5. Hals-Chakra",82,63,53,null,44,40,65,null,53,89,38,null,83,7,70,null,57]
[null," 4. Herz-Chakra",43,24,35,null,38,85,14,null,55,61,66,null,20,72,93,null,51]
[null," 3. Nabel-Chakra",83,19,40,null,55,76,93,null,1,97,35,null,81,39,50,null,56]
{"$rows_left_out":9}
{"sheet":"Graphik DNS","index":9,"n_rows":2,"n_cols":3,"rows_kept":2,"cut":false,"hidden":false,"merged":[]}
[]
[null," Herr Max Mustermann\n Geburtsort: Musterstadt\n Geburtstag: 20.06.1978\n\n Beratung: Dr. Peter Ruppel\n am 14.05.2018 um 13:53 Uhr","DNS"]

{"sheet":"Graphik Chakren","index":10,"n_rows":2,"n_cols":3,"rows_kept":2,"cut":false,"hidden":false,"merged":[]}
[]
[null," Herr Max Mustermann\n Geburtsort: Musterstadt\n Geburtstag: 20.06.1978\n\n Beratung: Dr. Peter Ruppel\n am 14.05.2018 um 13:53 Uhr","Chakra"]

{"sheet":"data","index":11,"n_rows":103,"n_cols":16,"rows_kept":103,"cut":false,"hidden":true,"merged":[]}
[null,null,null,null,null,null,null,null,null,null,null,null,null,null,null,90]
[null,"bolCalculated",false,null,null,null,null,null,null,null,null,null,null,null,null,84]
[null,null,null,null,null,null,null,null,null,null,null,"Filter",null,null,null,83]
[null,"Titel","Herr",null,null,{"$f":"Analyse!$C$5","v":" 1. Lebenskraft"},{"$f":"Analyse!$C$14","v":59},null,{"$f":"MID(Analyse!$B$12,5,100)","v":"Wurzel-Chakra"},{"$f":"Analyse!$S$12","v":52},null,3,null,10,null,82]
[null,"Vorname","Max",null,null,{"$f":"Analyse!$D$5","v":" 2. Lebensziel"},{"$f":"Analyse!$D$14","v":41},null,{"$f":"MID(Analyse!$B$11,5,100)","v":"Sakral-Chakra"},{"$f":"Analyse!$S$11","v":43},null,3,">",20,null,77]
[null,"Name","Mustermann",null,null,{"$f":"Analyse!$E$5","v":" 3. Schöpfungskraft"},{"$f":"Analyse!$E$14","v":48},null,{"$f":"MID(Analyse!$B$10,5,100)","v":"Nabel-Chakra"},{"$f":"Analyse!$S$10","v":56},null,null,"<",30,null,72]
[null,"Geburtsort","Musterstadt",null,null,{"$f":"Analyse!$G$5","v":" 4. Wohlbefinden"},{"$f":"Analyse!$G$14","v":47},null,{"$f":"MID(Analyse!$B$9,5,100)","v":"Herz-Chakra"},{"$f":"Analyse!$S$9","v":51},null,null,null,40,null,68]
[null,"Geburtstag","20.06.1978",null,null,{"$f":"Analyse!$H$5","v":" 5. Lebensfreude"},{"$f":"Analyse!$H$14","v":60},null,{"$f":"MID(Analyse!$B$8,5,100)","v":"Hals-Chakra"},{"$f":"Analyse!$S$8","v":57},null,null,null,null,null,65]
[null,"Datum","14.05.2018",null,null,{"$f":"Analyse!$I$5","v":" 6. Wahrhaftigkeit"},{"$f":"Analyse!$I$14","v":58},null,{"$f":"MID(Analyse!$B$7,5,100)","v":"Stirn-Chakra"},{"$f":"Analyse!$S$7","v":46},null,null,null,6,null,64]
[null,"Uhrzeit","13:53",null,null,{"$f":"Analyse!$K$5","v":" 7. Ordnung"},{"$f":"Analyse!$K$14","v":33},null,{"$f":"MID(Analyse!$B$6,5,100)","v":"Scheitel-Chakra"},{"$f":"Analyse!$S$6","v":38},null,null,null,7,null,61]
{"$rows_left_out":94}
{"sheet":"Heilmittel-Liste","index":12,"n_rows":4,"n_cols":6,"rows_kept":4,"cut":false,"hidden":true,"merged":[[1,0,1,1]]}
[]
[" Herr Max Mustermann\n Geburtsort: Musterstadt\n Geburtstag: 20.06.1978\n\n Beratung: Dr. Peter Ruppel\n am 14.05.2018 um 13:53 Uhr",null,"Heilmittel - Liste"]
[]
[" Nr.","DNS / Chakra / Aktivierung",null,"Gruppe","Heilmittel","Potential"]

{"sheet":"Heilmittel GLOBAL","index":13,"n_rows":1696,"n_cols":2,"rows_kept":1696,"cut":false,"hidden":true,"merged":[]}
["Gruppe","Heilmittel"]
["Affirmationen","Es steht mir zu."]
["Affirmationen","Für alles, was ich brauche, ist immer gesorgt."]
["Affirmationen","Geld bewirkt viel Gutes"]
["Affirmationen","Geld gibt mir viele Möglichkeiten"]
["Affirmationen","Geld ist Energie"]
["Affirmationen","Geld ist etwas Angenehmes"]
["Affirmationen","Geld ist etwas Schönes und Gutes"]
["Affirmationen","Geld ist Freiheit"]
["Affirmationen","Geld ist mein Freund"]
{"$rows_left_out":1687}
{"sheet":"arszWksRemediesTemplate","index":14,"n_rows":60,"n_cols":8,"rows_kept":60,"cut":false,"hidden":true,"merged":[[4,0,4,5],[5,0,5,5],[40,0,40,5],[1,3,1,5]]}
[]
[null,null,null,"Schuessler Salze\nNr. 15 Kalium Jodatum"]
[]
[]
["Komplexmittel (ein Blatt für die gesamte Sitzung)"]
[{"$f":"\"Rate: \"&H7&H8&H9&H10&H11&H12&H13&H14","v":"Rate: 82454548"},null,null,null,null,null,null,"Rate:"]
[null,null,null,null,null,null,null,{"$f":"RANDBETWEEN(1,9)","v":8}]
[null,null,null,null,null,null,null,{"$f":"RANDBETWEEN(1,9)","v":2}]
[null,null,null,null,null,null,null,4]
[null,null,null,null,null,null,null,5]
{"$rows_left_out":51}
{"sheet":"arszWksDescriptionsTemplate","index":15,"n_rows":12,"n_cols":4,"rows_kept":12,"cut":false,"hidden":true,"merged":[[9,3,9,4],[11,3,11,4],[1,3,1,5],[5,2,5,4],[7,2,7,4]]}
[]
[null,null,null,"Affirmationen\nIch bin erfolgreich"]
[]
[]
[null,"DNS allgemein"]
[null,null,"DNS ist die Abkürzung für ein chemisches Element, das unsere Erbanlage auf der physischen Ebene beschreibt. Die meisten Anlagen eines Menschen bestehen nur auf der geistigen Ebene und haben auf der physischen Ebene in der DNS keine Repräsentanz (vielleicht auch noch nicht ganz erforscht). Auch für die rein geistigen Anlagen verwenden wir den Begriff DNS (obgleich nicht ganz korrekt). "]
[null,"1. DNS Lebenskraft"]
[null,null,"Die Erbanlage „Lebenskraft“ ist der einzige DNS Strang der physisch ausgebildet ist und den die Wissenschaft kennt. Durch ihn erhalten wir die Fähigkeiten mit einem Körper das irdische Leben zu meistern."]
[null,"4. Herz-Chakra"]
[null,null,null,"Chakren sind feinstoffliche Kraftwirbel, die unseren Körper mit Energie versorgen.\nDas 4. Chakra ist das Herzchakra. Dies ist das wichtigste. Es bezieht sich auf die Fähigkeit zu Lieben."]
{"$rows_left_out":3}
{"sheet":"Beschreibungen","index":16,"n_rows":99,"n_cols":4,"rows_kept":99,"cut":false,"hidden":true,"merged":[[88,3,88,4],[90,2,90,4],[92,3,92,4],[94,3,94,4],[96,3,96,4],[98,3,98,4],[76,3,76,4],[78,3,78,4],[80,2,80,4],[82,3,82,4],[84,3,84,4],[86,3,86,4],[64,3,64,4],[66,3,66,4],[68,3,68,4],[70,2,70,4],[72,3,72,4],[74,3,74,4],[52,3,52,4],[54,3,54,4],[56,3,56,4],[58,3,58,4],[60,2,60,4],[62,3,62,4],[40,2,40,4],[42,3,42,4],[44,3,44,4],[46,3,46,4],[48,3,48,4],[50,2,50,4],[27,2,27,4],[30,2,30,4],[32,3,32,4],[34,3,34,4],[36,3,36,4],[38,3,38,4],[15,2,15,4],[17,2,17,4],[19,2,19,4],[21,2,21,4],[23,2,23,4],[25,2,25,4],[3,2,3,4],[5,2,5,4],[7,2,7,4],[9,2,9,4],[11,2,11,4],[13,2,13,4]]}
[]
[]
[null,"DNS allgemein"]
["DNS_0",null,"DNS ist die Abkürzung für ein chemisches Element, das unsere Erbanlage auf der physischen Ebene beschreibt. Die meisten Anlagen eines Menschen bestehen nur auf der geistigen Ebene und haben auf der physischen Ebene in der DNS keine Repräsentanz (vielleicht auch noch nicht ganz erforscht). Auch für die rein geistigen Anlagen verwenden wir den Begriff DNS (obgleich nicht ganz korrekt). "]
[null,"1. DNS Lebenskraft"]
["DNS_0_1",null,"Die Erbanlage „Lebenskraft“ ist der einzige DNS Strang der physisch ausgebildet ist und den die Wissenschaft kennt. Durch ihn erhalten wir die Fähigkeiten mit einem Körper das irdische Leben zu meistern."]
[null,"2. DNS Lebensziel"]
["DNS_0_2",null,"Diese Anlage „Lebensziel“ wird auf der physischen Ebenen nicht durch einen DNS Strang repräsentiert. Das Lebensziel beschreibt unseren Lebensplan und die Lernziele, die erreicht werden sollen. Diese Informationen sind sehr ähnlich mit dem Inhalt eines Geburtshoroskopes."]
[null,"3. DNS Schöpferkraft"]
["DNS_0_3",null,"Mit der „Schöpferkraft“ wird unser Potential zum Erschaffen auf der irdischen Ebene definiert. Dies bezieht sich nicht nur auf das Zeugen von Nachkommen, sondern ganz allgemein auf das Erschaffen von Werken, die unsere Existenz überdauern."]
{"$rows_left_out":89}